Target
Voltage-dependent L-type calcium channel subunit alpha-1C
Ligand
BDBM50030613
Substrate
Meas. Tech.
ChEMBL_214787 (CHEMBL815524)
Ki
>5000±n/a nM
Citation
 Ruffolo, RRBondinell, WHieble, JP Alpha- and beta-adrenoceptors: from the gene to the clinic. 2. Structure-activity relationships and therapeutic applications. J Med Chem 38:3681-716 (1995)  
Target
Name:
Voltage-dependent L-type calcium channel subunit alpha-1C
Synonyms:
CAC1C_RAT Cacn2 Cacnl1a1 Calcium channel (Type L) Calcium channel, L type, alpha-1 polypeptide, isoform 1, cardiac muscle RBC Voltage-dependent L-type calcium channel subunit alpha-1C Voltage-gated L-type calcium channel alpha-1C subunit | Voltage-gated calcium channel subunit alpha Cav1.2
Type:
Enzyme Catalytic Domain
Mol. Mass.:
243492.26
Organism:
RAT
Description:
Calcium channel 0 RAT::P22002
Residue:
2169
  
Inhibitor
Name:
BDBM50030613
Synonyms:
2,6-Dimethyl-4-(4-nitro-phenyl)-pyridine-3,5-dicarboxylic acid 3-{[3-(4,4-diphenyl-piperidin-1-yl)-propyl]-amide} 5-methylamide | CHEMBL125294
Type:
Small organic molecule
Emp. Form.:
C36H39N5O4
Mol. Mass.:
605.726
SMILES:
CNC(=O)c1c(C)nc(C)c(C(=O)NCCCN2CCC(CC2)(c2ccccc2)c2ccccc2)c1-c1ccc(cc1)[N+]([O-])=O
: