Target
Alpha-1B adrenergic receptor
Ligand
BDBM50030613
Substrate
Meas. Tech.
ChEMBL_34343 (CHEMBL649156)
Ki
416±n/a nM
Citation
 Ruffolo, RRBondinell, WHieble, JP Alpha- and beta-adrenoceptors: from the gene to the clinic. 2. Structure-activity relationships and therapeutic applications. J Med Chem 38:3681-716 (1995)  
Target
Name:
Alpha-1B adrenergic receptor
Synonyms:
ADA1B_HUMAN Adrenergic alpha1B Adrenergic receptor alpha Alpha 1B-adrenoreceptor | Alpha-1B adrenergic receptor
Type:
Enzyme
Mol. Mass.:
56862.13
Organism:
Homo sapiens (Human)
Description:
P35368
Residue:
520
  
Inhibitor
Name:
BDBM50030613
Synonyms:
2,6-Dimethyl-4-(4-nitro-phenyl)-pyridine-3,5-dicarboxylic acid 3-{[3-(4,4-diphenyl-piperidin-1-yl)-propyl]-amide} 5-methylamide | CHEMBL125294
Type:
Small organic molecule
Emp. Form.:
C36H39N5O4
Mol. Mass.:
605.726
SMILES:
CNC(=O)c1c(C)nc(C)c(C(=O)NCCCN2CCC(CC2)(c2ccccc2)c2ccccc2)c1-c1ccc(cc1)[N+]([O-])=O
: