Target
Adenosine deaminase
Ligand
BDBM50407532
Substrate
Meas. Tech.
ChEMBL_30794 (CHEMBL645070)
Ki
100000±n/a nM
Citation
 Cristalli, GVittori, SEleuteri, AVolpini, RCamaioni, ELupidi, GMahmood, NBevilacqua, FPalù, G Synthesis and biological evaluation of N6-cycloalkyl derivatives of 1-deazaadenine nucleosides: a new class of anti-human immunodeficiency virus agents. J Med Chem 38:4019-25 (1995)  
Target
Name:
Adenosine deaminase
Synonyms:
ADA Adenosine aminohydrolase
Type:
Enzyme
Mol. Mass.:
40910.44
Organism:
Bos taurus (bovine)
Description:
Residue:
363
  
Inhibitor
Name:
BDBM50407532
Synonyms:
CHEMBL2113516
Type:
Small organic molecule
Emp. Form.:
C15H20N4O4
Mol. Mass.:
320.3437
SMILES:
OC[C@H]1O[C@H]([C@H](O)[C@@H]1O)n1cnc2c(NC3CCC3)ccnc12
: