Target
Adenosine deaminase
Ligand
BDBM50031257
Substrate
Meas. Tech.
ChEMBL_30794 (CHEMBL645070)
Ki
92000±n/a nM
Citation
 Cristalli, GVittori, SEleuteri, AVolpini, RCamaioni, ELupidi, GMahmood, NBevilacqua, FPalù, G Synthesis and biological evaluation of N6-cycloalkyl derivatives of 1-deazaadenine nucleosides: a new class of anti-human immunodeficiency virus agents. J Med Chem 38:4019-25 (1995)  
Target
Name:
Adenosine deaminase
Synonyms:
ADA Adenosine aminohydrolase
Type:
Enzyme
Mol. Mass.:
40910.44
Organism:
Bos taurus (bovine)
Description:
Residue:
363
  
Inhibitor
Name:
BDBM50031257
Synonyms:
CHEMBL130032 | [5-(7-Cyclobutylamino-imidazo[4,5-b]pyridin-3-yl)-tetrahydro-furan-2-yl]-methanol
Type:
Small organic molecule
Emp. Form.:
C15H20N4O2
Mol. Mass.:
288.3449
SMILES:
OCC1CCC(O1)n1cnc2c(NC3CCC3)ccnc12
: