Target
Adenosine deaminase
Ligand
BDBM50031265
Substrate
Meas. Tech.
ChEMBL_30794 (CHEMBL645070)
Ki
11000±n/a nM
Citation
 Cristalli, GVittori, SEleuteri, AVolpini, RCamaioni, ELupidi, GMahmood, NBevilacqua, FPalù, G Synthesis and biological evaluation of N6-cycloalkyl derivatives of 1-deazaadenine nucleosides: a new class of anti-human immunodeficiency virus agents. J Med Chem 38:4019-25 (1995)  
Target
Name:
Adenosine deaminase
Synonyms:
ADA Adenosine aminohydrolase
Type:
Enzyme
Mol. Mass.:
40910.44
Organism:
Bos taurus (bovine)
Description:
Residue:
363
  
Inhibitor
Name:
BDBM50031265
Synonyms:
CHEMBL130172 | [5-(5-Chloro-7-methylamino-imidazo[4,5-b]pyridin-3-yl)-tetrahydro-furan-2-yl]-methanol
Type:
Small organic molecule
Emp. Form.:
C12H15ClN4O2
Mol. Mass.:
282.726
SMILES:
CNc1cc(Cl)nc2n(cnc12)C1CCC(CO)O1
: