Target
Adenosine deaminase
Ligand
BDBM50369065
Substrate
Meas. Tech.
ChEMBL_30794 (CHEMBL645070)
Ki
80000±n/a nM
Citation
 Cristalli, GVittori, SEleuteri, AVolpini, RCamaioni, ELupidi, GMahmood, NBevilacqua, FPalù, G Synthesis and biological evaluation of N6-cycloalkyl derivatives of 1-deazaadenine nucleosides: a new class of anti-human immunodeficiency virus agents. J Med Chem 38:4019-25 (1995)  
Target
Name:
Adenosine deaminase
Synonyms:
ADA Adenosine aminohydrolase
Type:
Enzyme
Mol. Mass.:
40910.44
Organism:
Bos taurus (bovine)
Description:
Residue:
363
  
Inhibitor
Name:
BDBM50369065
Synonyms:
CHEMBL606228
Type:
Small organic molecule
Emp. Form.:
C19H28N4O4
Mol. Mass.:
376.45
SMILES:
OC[C@H]1OC([C@H](O)[C@@H]1O)n1cnc2c(NC3CCCCCCC3)ccnc12
: