Target
Adenosine deaminase
Ligand
BDBM50031284
Substrate
Meas. Tech.
ChEMBL_30794 (CHEMBL645070)
Ki
59000±n/a nM
Citation
 Cristalli, GVittori, SEleuteri, AVolpini, RCamaioni, ELupidi, GMahmood, NBevilacqua, FPalù, G Synthesis and biological evaluation of N6-cycloalkyl derivatives of 1-deazaadenine nucleosides: a new class of anti-human immunodeficiency virus agents. J Med Chem 38:4019-25 (1995)  
Target
Name:
Adenosine deaminase
Synonyms:
ADA Adenosine aminohydrolase
Type:
Enzyme
Mol. Mass.:
40910.44
Organism:
Bos taurus (bovine)
Description:
Residue:
363
  
Inhibitor
Name:
BDBM50031284
Synonyms:
5-(7-Cyclooctylamino-imidazo[4,5-b]pyridin-3-yl)-2-hydroxymethyl-tetrahydro-furan-3-ol | CHEMBL422081
Type:
Small organic molecule
Emp. Form.:
C19H28N4O3
Mol. Mass.:
360.4506
SMILES:
OCC1OC(CC1O)n1cnc2c(NC3CCCCCCC3)ccnc12
: