Target
Transient receptor potential cation channel subfamily V member 1
Ligand
BDBM20461
Substrate
Meas. Tech.
ChEMBL_215637 (CHEMBL820955)
Ki
2000±n/a nM
Citation
 Appendino, GCravotto, GPalmisano, GAnnunziata, RSzallasi, A Synthesis and evaluation of phorboid 20-homovanillates: discovery of a class of ligands binding to the vanilloid (capsaicin) receptor with different degrees of cooperativity. J Med Chem 39:3123-31 (1996)  
Target
Name:
Transient receptor potential cation channel subfamily V member 1
Synonyms:
Capsaicin receptor TRPV1_RAT Trpv1 Vanilloid VR1 Vanilloid receptor 1 (VRI/TRPV1) Vanilloid receptor type 1-like (TrpV1/Vr1) Vr1l | osm-9-like TRP channel 1
Type:
Transient Receptor
Mol. Mass.:
94956.12
Organism:
Rattus norvegicus (rat)
Description:
O35433
Residue:
838
  
Inhibitor
Name:
BDBM20461
Synonyms:
(6E)-N-[(4-hydroxy-3-methoxyphenyl)methyl]-8-methylnon-6-enamide CAP Capsaicin | Zostrix
Type:
Emp. Form.:
C18H27NO3
Mol. Mass.:
305.4119
SMILES:
COc1cc(CNC(=O)CCCC\C=C\C(C)C)ccc1O
: