Target
Metabotropic glutamate receptor 6
Ligand
BDBM50052555
Substrate
Meas. Tech.
ChEMBL_104469 (CHEMBL712215)
EC50
410000±n/a nM
Citation
 Bräuner-Osborne, HSløk, FASkjaerbaek, NEbert, BSekiyama, NNakanishi, SKrogsgaard-Larsen, P A new highly selective metabotropic excitatory amino acid agonist: 2-amino-4-(3-hydroxy-5-methylisoxazol-4-yl)butyric acid. J Med Chem 39:3188-94 (1996)  
Target
Name:
Metabotropic glutamate receptor 6
Synonyms:
GPRC1F GRM6_HUMAN Metabotropic glutamate receptor 6 metabotropic glutamate 6
Type:
Enzyme Catalytic Domain
Mol. Mass.:
95479.26
Organism:
Homo sapiens (Human)
Description:
metabotropic glutamate 6 GRM6 HUMAN::O15303
Residue:
877
  
Inhibitor
Name:
BDBM50052555
Synonyms:
2-Amino-5-(3-hydroxy-5-methyl-isoxazol-4-yl)-pentanoic acid | CHEMBL324686
Type:
Small organic molecule
Emp. Form.:
C9H14N2O4
Mol. Mass.:
214.2185
SMILES:
Cc1o[nH]c(=O)c1CCCC(N)C(O)=O
: