Target
D(4) dopamine receptor
Ligand
BDBM50123626
Substrate
Meas. Tech.
ChEMBL_61153 (CHEMBL670689)
Ki
55±n/a nM
Citation
 van Vliet, LATepper, PGDijkstra, DDamsma, GWikström, HPugsley, TAAkunne, HCHeffner, TGGlase, SAWise, LD Affinity for dopamine D2, D3, and D4 receptors of 2-aminotetralins. Relevance of D2 agonist binding for determination of receptor subtype selectivity. J Med Chem 39:4233-7 (1996)  
Target
Name:
D(4) dopamine receptor
Synonyms:
D(2C) dopamine receptor DOPAMINE D4.2 DRD4 Dopamine D4 receptor
Type:
Enzyme
Mol. Mass.:
48373.19
Organism:
Homo sapiens (Human)
Description:
P21917
Residue:
419
  
Inhibitor
Name:
BDBM50123626
Synonyms:
(S)-6-[Propyl-(2-thiophen-2-yl-ethyl)-amino]-5,6,7,8-tetrahydro-naphthalen-1-ol Neupro | ROTIGOTINE
Type:
Small organic molecule
Emp. Form.:
C19H25NOS
Mol. Mass.:
315.473
SMILES:
CCCN(CCc1cccs1)[C@H]1CCc2c(O)cccc2C1
: