Target
D(3) dopamine receptor
Ligand
BDBM50054082
Substrate
Meas. Tech.
ChEMBL_62265 (CHEMBL675667)
Ki
0.75±n/a nM
Citation
 van Vliet, LATepper, PGDijkstra, DDamsma, GWikström, HPugsley, TAAkunne, HCHeffner, TGGlase, SAWise, LD Affinity for dopamine D2, D3, and D4 receptors of 2-aminotetralins. Relevance of D2 agonist binding for determination of receptor subtype selectivity. J Med Chem 39:4233-7 (1996)  
Target
Name:
D(3) dopamine receptor
Synonyms:
DOPAMINE D3 DRD3_HUMAN Dopamine D3 receptor (D3) Dopamine receptor Dopamine receptor D3
Type:
Mol. Mass.:
44243.43
Organism:
Homo sapiens (Human)
Description:
Residue:
400
  
Inhibitor
Name:
BDBM50054082
Synonyms:
7-[Propyl-(2-thiophen-2-yl-ethyl)-amino]-5,6,7,8-tetrahydro-naphthalen-2-ol | CHEMBL135954
Type:
Small organic molecule
Emp. Form.:
C19H25NOS
Mol. Mass.:
315.473
SMILES:
CCCN(CCc1cccs1)C1CCc2ccc(O)cc2C1
: