Target
Glucocorticoid receptor
Ligand
BDBM50407990
Substrate
Meas. Tech.
ChEMBL_71419 (CHEMBL685137)
IC50
5.3±n/a nM
Citation
 Ashton, MJLawrence, CKarlsson, JAStuttle, KANewton, CGVacher, BYWebber, SWithnall, MJ Anti-inflammatory 17beta-thioalkyl-16alpha,17alpha-ketal and -acetal androstanes: a new class of airway selective steroids for the treatment of asthma. J Med Chem 39:4888-96 (1997)  
Target
Name:
Glucocorticoid receptor
Synonyms:
GCR_RAT Glucocorticoid Receptor (GR) Grl | Nr3c1
Type:
Enzyme Catalytic Domain
Mol. Mass.:
87556.83
Organism:
RAT
Description:
Glucocorticoid 0 RAT::P06536
Residue:
795
  
Inhibitor
Name:
BDBM50407990
Synonyms:
CHEMBL2112858
Type:
Small organic molecule
Emp. Form.:
C23H31FO6S
Mol. Mass.:
454.552
SMILES:
CC1(C)O[C@@H]2C[C@H]3[C@@H]4CCC5=CC(=O)C=C[C@]5(C)[C@@]4(F)[C@@H](O)C[C@]3(C)[C@@]2(O1)S(C)(=O)=O
: