Target
Muscarinic acetylcholine receptor M2
Ligand
BDBM50369230
Substrate
Meas. Tech.
ChEMBL_140180 (CHEMBL744097)
Ki
0.43±n/a nM
Citation
 Visser, TJvan Waarde, AJansen, TJVisser, GMvan der Mark, TWKraan, JEnsing, KVaalburg, W Stereoselective synthesis and biodistribution of potent [11C]-labeled antagonists for positron emission tomography imaging of muscarinic receptors in the airways. J Med Chem 40:117-24 (1997)  
Target
Name:
Muscarinic acetylcholine receptor M2
Synonyms:
ACM2_RAT Chrm-2 | Chrm2
Type:
Enzyme Catalytic Domain
Mol. Mass.:
51555.53
Organism:
RAT
Description:
P10980
Residue:
466
  
Inhibitor
Name:
BDBM50369230
Synonyms:
CHEMBL1398637 | CLIDINIUM
Type:
Small organic molecule
Emp. Form.:
C22H26NO3
Mol. Mass.:
352.4462
SMILES:
C[N+]12CCC(CC1)[C@H](C2)OC(=O)C(O)(c1ccccc1)c1ccccc1
: