Target
D(1) dopamine receptor
Ligand
BDBM50057852
Substrate
Meas. Tech.
ChEMBL_59005 (CHEMBL880003)
EC50
28±n/a nM
Citation
 Michaelides, MRHong, YDiDomenico, SBayburt, EKAsin, KEBritton, DRLin, CWShiosaki, K Substituted hexahydrobenzo[f]thieno[c]quinolines as dopamine D1-selective agonists: synthesis and biological evaluation in vitro and in vivo. J Med Chem 40:1585-99 (1997)  
Target
Name:
D(1) dopamine receptor
Synonyms:
D(1) dopamine receptor Dopamine D1 receptor
Type:
Mol. Mass.:
40664.04
Organism:
Carassius auratus
Description:
Residue:
363
  
Inhibitor
Name:
BDBM50057852
Synonyms:
(5aS,11bS)-2-tert-Butyl-4,5,5a,6,7,11b-hexahydro-1-thia-5-aza-cyclopenta[c]phenanthrene-9,10-diol | CHEMBL291100
Type:
Small organic molecule
Emp. Form.:
C19H23NO2S
Mol. Mass.:
329.456
SMILES:
CC(C)(C)c1cc2CN[C@H]3CCc4cc(O)c(O)cc4[C@@H]3c2s1
: