Target
Polyunsaturated fatty acid 5-lipoxygenase
Ligand
BDBM50000541
Substrate
Meas. Tech.
ChEMBL_4202 (CHEMBL620004)
IC50
500±n/a nM
Citation
 Stewart, AOBhatia, PAMartin, JGSummers, JBRodriques, KEMartin, MBHolms, JHMoore, JLCraig, RAKolasa, TRatajczyk, JDMazdiyasni, HKerdesky, FADeNinno, SLMaki, RGBouska, JBYoung, PRLanni, CBell, RLCarter, GWBrooks, CD Structure-activity relationships of N-hydroxyurea 5-lipoxygenase inhibitors. J Med Chem 40:1955-68 (1997)  
Target
Name:
Polyunsaturated fatty acid 5-lipoxygenase
Synonyms:
Alox5 LOX5_RAT
Type:
PROTEIN
Mol. Mass.:
78082.31
Organism:
Rattus norvegicus
Description:
ChEMBL_1432947
Residue:
673
  
Inhibitor
Name:
BDBM50000541
Synonyms:
(+-)-1-(1-Benzo[b]thien-2-ylethyl)-1-hydroxyurea CHEMBL93 N-(1-Benzo(b)thien-2-ylethyl)-N-hydroxyurea ZILEUTON | Zyflo (TN)
Type:
Small organic molecule
Emp. Form.:
C11H12N2O2S
Mol. Mass.:
236.29
SMILES:
CC(N(O)C(N)=O)c1cc2ccccc2s1
: