Target
Nitric oxide synthase, endothelial
Ligand
BDBM50059647
Substrate
Meas. Tech.
ChEMBL_65144 (CHEMBL678112)
Ki
375000±n/a nM
Citation
 Silverman, RBHuang, HMarletta, MAMartasek, P Selective inhibition of neuronal nitric oxide synthase by N omega-nitroarginine-and phenylalanine-containing dipeptides and dipeptide esters. J Med Chem 40:2813-7 (1997)  
Target
Name:
Nitric oxide synthase, endothelial
Synonyms:
Constitutive NOS Endothelial nitric oxide synthase NOS type III NOS3_BOVIN Nitric-oxide synthase, endothelial | cNOS
Type:
Enzyme
Mol. Mass.:
133292.26
Organism:
Bos taurus (bovine)
Description:
Recombinant eNOS overexpressed in E. coli was used in enzyme assays.
Residue:
1205
  
Inhibitor
Name:
BDBM50059647
Synonyms:
CHEMBL97782 | D-Nitroarginine,methoxy-D-phenylalanine,with 2M of hydrochloric acid
Type:
Small organic molecule
Emp. Form.:
C16H24N6O5
Mol. Mass.:
380.399
SMILES:
COC(=O)[C@@H](Cc1ccccc1)NC(=O)[C@H](N)CCCNC(=N)N[N+]([O-])=O
: