Target
Nitric oxide synthase, endothelial
Ligand
BDBM50369306
Substrate
Meas. Tech.
ChEMBL_65144 (CHEMBL678112)
Ki
125000±n/a nM
Citation
 Silverman, RBHuang, HMarletta, MAMartasek, P Selective inhibition of neuronal nitric oxide synthase by N omega-nitroarginine-and phenylalanine-containing dipeptides and dipeptide esters. J Med Chem 40:2813-7 (1997)  
Target
Name:
Nitric oxide synthase, endothelial
Synonyms:
Constitutive NOS Endothelial nitric oxide synthase NOS type III NOS3_BOVIN Nitric-oxide synthase, endothelial | cNOS
Type:
Enzyme
Mol. Mass.:
133292.26
Organism:
Bos taurus (bovine)
Description:
Recombinant eNOS overexpressed in E. coli was used in enzyme assays.
Residue:
1205
  
Inhibitor
Name:
BDBM50369306
Synonyms:
CHEMBL1202112
Type:
Small organic molecule
Emp. Form.:
C22H28N6O5
Mol. Mass.:
456.4949
SMILES:
N[C@@H](CCCN=C(N)N[N+]([O-])=O)C(=O)N[C@@H](Cc1ccccc1)C(=O)OCc1ccccc1
: