Target
Plasma kallikrein
Ligand
BDBM50060019
Substrate
Meas. Tech.
ChEMBL_92236 (CHEMBL703581)
Ki
97000±n/a nM
Citation
 Stürzebecher, JPrasa, DHauptmann, JVieweg, HWikström, P Synthesis and structure-activity relationships of potent thrombin inhibitors: piperazides of 3-amidinophenylalanine. J Med Chem 40:3091-9 (1997)  
Target
Name:
Plasma kallikrein
Synonyms:
Fletcher factor KLKB1 Kallikrein Plasma kallikrein heavy chain Plasma prekallikrein
Type:
Protein
Mol. Mass.:
71391.16
Organism:
Homo sapiens (Human)
Description:
P03952
Residue:
638
  
Inhibitor
Name:
BDBM50060019
Synonyms:
3-[(R)-3-(4-Methanesulfonyl-piperazin-1-yl)-3-oxo-2-(2,2,5,7,8-pentamethyl-chroman-6-sulfonylamino)-propyl]-benzamidine | CHEMBL107743
Type:
Small organic molecule
Emp. Form.:
C29H41N5O6S2
Mol. Mass.:
619.796
SMILES:
Cc1c(C)c(c(C)c2CCC(C)(C)Oc12)S(=O)(=O)N[C@H](Cc1cccc(c1)C(N)=N)C(=O)N1CCN(CC1)S(C)(=O)=O
: