Target
Coagulation factor X
Ligand
BDBM50060019
Substrate
Meas. Tech.
ChEMBL_48481 (CHEMBL662059)
Ki
41000±n/a nM
Citation
 Stürzebecher, JPrasa, DHauptmann, JVieweg, HWikström, P Synthesis and structure-activity relationships of potent thrombin inhibitors: piperazides of 3-amidinophenylalanine. J Med Chem 40:3091-9 (1997)  
Target
Name:
Coagulation factor X
Synonyms:
Coagulation factor X FA10_BOVIN | Factor Xa (fXa)
Type:
PROTEIN
Mol. Mass.:
54498.45
Organism:
Bos taurus
Description:
ChEMBL_1364435
Residue:
492
  
Inhibitor
Name:
BDBM50060019
Synonyms:
3-[(R)-3-(4-Methanesulfonyl-piperazin-1-yl)-3-oxo-2-(2,2,5,7,8-pentamethyl-chroman-6-sulfonylamino)-propyl]-benzamidine | CHEMBL107743
Type:
Small organic molecule
Emp. Form.:
C29H41N5O6S2
Mol. Mass.:
619.796
SMILES:
Cc1c(C)c(c(C)c2CCC(C)(C)Oc12)S(=O)(=O)N[C@H](Cc1cccc(c1)C(N)=N)C(=O)N1CCN(CC1)S(C)(=O)=O
: