Target
Nitric oxide synthase, endothelial
Ligand
BDBM50061233
Substrate
Meas. Tech.
ChEMBL_65145 (CHEMBL678113)
Ki
9500±n/a nM
Citation
 Zhang, HQFast, WMarletta, MAMartasek, PSilverman, RB Potent and selective inhibition of neuronal nitric oxide synthase by N omega-propyl-L-arginine. J Med Chem 40:3869-70 (1998)  
Target
Name:
Nitric oxide synthase, endothelial
Synonyms:
Constitutive NOS Endothelial nitric oxide synthase NOS type III NOS3_BOVIN Nitric-oxide synthase, endothelial | cNOS
Type:
Enzyme
Mol. Mass.:
133292.26
Organism:
Bos taurus (bovine)
Description:
Recombinant eNOS overexpressed in E. coli was used in enzyme assays.
Residue:
1205
  
Inhibitor
Name:
BDBM50061233
Synonyms:
2-Amino-5-(N'-ethyl-guanidino)-pentanoic acid | CHEMBL333229
Type:
Small organic molecule
Emp. Form.:
C8H18N4O2
Mol. Mass.:
202.2541
SMILES:
CCNC(=N)NCCCC([NH3+])C([O-])=O
: