Target
Nitric oxide synthase, brain
Ligand
BDBM50061231
Substrate
Meas. Tech.
ChEMBL_143344 (CHEMBL751926)
Ki
57±n/a nM
Citation
 Zhang, HQFast, WMarletta, MAMartasek, PSilverman, RB Potent and selective inhibition of neuronal nitric oxide synthase by N omega-propyl-L-arginine. J Med Chem 40:3869-70 (1998)  
Target
Name:
Nitric oxide synthase, brain
Synonyms:
Bnos NC-NOS NOS type I nNOS Neuronal nitric oxide synthase Nitric Oxide Synthase, brain Nitric oxide synthase, brain (nNOS) Nitric-oxide synthase, brain (nNOS) Nos1 | Peptidyl-cysteine S-nitrosylase NOS1
Type:
Enzyme
Mol. Mass.:
160570.98
Organism:
Rattus norvegicus (rat)
Description:
Recombinant nNOS overexpressed in E. coli was used in enzyme assays.
Residue:
1429
  
Inhibitor
Name:
BDBM50061231
Synonyms:
2-Amino-5-(N'-propyl-guanidino)-pentanoic acid | CHEMBL126713
Type:
Small organic molecule
Emp. Form.:
C9H20N4O2
Mol. Mass.:
216.2807
SMILES:
CCCNC(=N)NCCCC([NH3+])C([O-])=O
: