Target
Gastrin/cholecystokinin type B receptor
Ligand
BDBM50061271
Substrate
Meas. Tech.
ChEMBL_48607 (CHEMBL659588)
Ki
24±n/a nM
Citation
 Bellier, BMcCort-Tranchepain, IDucos, BDanascimento, SMeudal, HNoble, FGarbay, CRoques, BP Synthesis and biological properties of new constrained CCK-B antagonists: discrimination of two affinity states of the CCK-B receptor on transfected CHO cells. J Med Chem 40:3947-56 (1998)  
Target
Name:
Gastrin/cholecystokinin type B receptor
Synonyms:
Cckbr Cholecystokinin B receptor GASR_RAT | Gastrin/cholecystokinin type B receptor
Type:
Enzyme Catalytic Domain
Mol. Mass.:
48980.43
Organism:
RAT
Description:
Cholecystokinin A CCKBR RAT::P30553
Residue:
452
  
Inhibitor
Name:
BDBM50061271
Synonyms:
(2R,4R)-1-[(R)-2-(2-Aza-tricyclo[3.3.1.1*3,7*]dec-2-yloxycarbonylamino)-3-(1H-indol-3-yl)-2-methyl-propionyl]-4-(4-chloro-phenoxy)-pyrrolidine-2-carboxylic acid | CHEMBL435404
Type:
Small organic molecule
Emp. Form.:
C33H37ClN4O6
Mol. Mass.:
621.123
SMILES:
C[C@](Cc1c[nH]c2ccccc12)(NC(=O)ON1[C@H]2C[C@@H]3C[C@@H](C[C@H]1C3)C2)C(=O)N1C[C@@H](C[C@@H]1C(O)=O)Oc1ccc(Cl)cc1
: