Target
Cannabinoid receptor 1
Ligand
BDBM50056460
Substrate
Meas. Tech.
ChEMBL_46811 (CHEMBL659697)
Ki
33±n/a nM
Citation
 Sheskin, THanus, LSlager, JVogel, ZMechoulam, R Structural requirements for binding of anandamide-type compounds to the brain cannabinoid receptor. J Med Chem 40:659-67 (1997)  
Target
Name:
Cannabinoid receptor 1
Synonyms:
Brain-type cannabinoid receptor CB-R CNR1_RAT Cannabinoid receptor Cnr1 | Skr6
Type:
G Protein-Coupled Receptor (GPCR)
Mol. Mass.:
52856.55
Organism:
Rattus norvegicus (rat)
Description:
P20272
Residue:
473
  
Inhibitor
Name:
BDBM50056460
Synonyms:
(5Z,8Z,11Z,14Z)-2-Methyl-icosa-5,8,11,14-tetraenoic acid (2-hydroxy-ethyl)-amide | CHEMBL158468
Type:
Small organic molecule
Emp. Form.:
C23H39NO2
Mol. Mass.:
361.5613
SMILES:
CCCCC\C=C/C\C=C/C\C=C/C\C=C/CCC(C)C(=O)NCCO
: