Target
Cannabinoid receptor 1
Ligand
BDBM85675
Substrate
Meas. Tech.
ChEMBL_46811 (CHEMBL659697)
Ki
34±n/a nM
Citation
 Sheskin, THanus, LSlager, JVogel, ZMechoulam, R Structural requirements for binding of anandamide-type compounds to the brain cannabinoid receptor. J Med Chem 40:659-67 (1997)  
Target
Name:
Cannabinoid receptor 1
Synonyms:
Brain-type cannabinoid receptor CB-R CNR1_RAT Cannabinoid receptor Cnr1 | Skr6
Type:
G Protein-Coupled Receptor (GPCR)
Mol. Mass.:
52856.55
Organism:
Rattus norvegicus (rat)
Description:
P20272
Residue:
473
  
Inhibitor
Name:
BDBM85675
Synonyms:
Anandamide + PMSF | CHEMBL321585
Type:
Small organic molecule
Emp. Form.:
C24H41NO2
Mol. Mass.:
375.5878
SMILES:
CCCCC\C=C/C\C=C/C\C=C/C\C=C/CCCCCC(=O)NCCO
: