Target
Sodium-dependent serotonin transporter
Ligand
BDBM50006774
Substrate
Meas. Tech.
ChEMBL_201800 (CHEMBL806135)
Ki
3±n/a nM
Citation
 Emond, PGarreau, LChalon, SBoazi, MCaillet, MBricard, JFrangin, YMauclaire, LBesnard, JCGuilloteau, D Synthesis and ligand binding of nortropane derivatives: N-substituted 2beta-carbomethoxy-3beta-(4'-iodophenyl)nortropane and N-(3-iodoprop-(2E)-enyl)-2beta-carbomethoxy-3beta-(3',4'-disubstituted phenyl)nortropane. New high-affinity and selective compounds for the dopamine transporter. J Med Chem 40:1366-72 (1997)  
Target
Name:
Sodium-dependent serotonin transporter
Synonyms:
5-HT Transporter 5HT transporter Anandamid membrane transporter, AMT Monoamine transporters; Norepinephrine & serotonin Slc6a4 Sodium-dependent serotonin transporter (SERT) | imipramine receptor
Type:
Multi-pass membrane protein
Mol. Mass.:
70168.43
Organism:
Rattus norvegicus (rat)
Description:
P31652
Residue:
630
  
Inhibitor
Name:
BDBM50006774
Synonyms:
(2S,3S)-methyl 3-(4-iodophenyl)-8-methyl-8-aza-bicyclo[3.2.1]octane-2-carboxylate CHEMBL311347 | methyl 3-(4-iodophenyl)-8-methyl-(2S,3S)-8-azabicyclo[3.2.1]octane-2-carboxylate
Type:
Small organic molecule
Emp. Form.:
C16H20INO2
Mol. Mass.:
385.24
SMILES:
COC(=O)[C@@H]1C2CC[C@H](C[C@@H]1c1ccc(I)cc1)N2C
: