Target
Glutamate receptor ionotropic, NMDA 1/2A
Ligand
BDBM50066545
Substrate
Meas. Tech.
ChEMBL_57 (CHEMBL615180)
IC50
32000±n/a nM
Citation
 Tamiz, APWhittemore, ERZhou, ZLHuang, JCDrewe, JAChen, JCCai, SXWeber, EWoodward, RMKeana, JF Structure-activity relationships for a series of bis(phenylalkyl)amines: potent subtype-selective inhibitors of N-methyl-D-aspartate receptors. J Med Chem 41:3499-506 (1998)  
Target
Name:
Glutamate receptor ionotropic, NMDA 1/2A
Synonyms:
Glutamate NMDA receptor; Grin1/Grin2a | Glutamate [NMDA] receptor subunit epsilon 1/zeta 1
Type:
Mol. Mass.:
Description:
ASSAY_ID of EBI is 141020
Components:
This complex has 2 components.
Component 1
Name:
Glutamate receptor ionotropic, NMDA 2A
Synonyms:
Glutamate NMDA receptor; Grin1/Grin2a Grin2a NMDE1_RAT
Type:
Protein
Mol. Mass.:
165478.25
Organism:
Rattus norvegicus (Rat)
Description:
Q00959
Residue:
1464
  
Component 2
Name:
Glutamate receptor ionotropic, NMDA 1
Synonyms:
Glutamate (NMDA) receptor subunit zeta 1 Glutamate-NMDA-Channel Glutamate-NMDA-Polyamine NMDA Nmdar1 | phencyclidine
Type:
Enzyme Catalytic Domain
Mol. Mass.:
105533.40
Organism:
RAT
Description:
P35439
Residue:
938
  
Inhibitor
Name:
BDBM50066545
Synonyms:
4-[(1S,2R)-1-Hydroxy-2-((R)-1-methyl-3-phenyl-propylamino)-propyl]-phenol | CHEMBL444851
Type:
Small organic molecule
Emp. Form.:
C19H25NO2
Mol. Mass.:
299.4073
SMILES:
C[C@H](CCc1ccccc1)N[C@H](C)[C@@H](O)c1ccc(O)cc1
: