Target
Procathepsin L
Ligand
BDBM50067608
Substrate
Meas. Tech.
ChEMBL_48494 (CHEMBL660643)
IC50
0.95±n/a nM
Citation
 Yasuma, TOi, SChoh, NNomura, TFuruyama, NNishimura, AFujisawa, YSohda, T Synthesis of peptide aldehyde derivatives as selective inhibitors of human cathepsin L and their inhibitory effect on bone resorption. J Med Chem 41:4301-8 (1998)  
Target
Name:
Procathepsin L
Synonyms:
CATL1_HUMAN CTSL CTSL1 Cathepsin L Cathepsin L1 heavy chain MEP cathepsin L preproprotein
Type:
Enzyme
Mol. Mass.:
37557.19
Organism:
Homo sapiens (Human)
Description:
Purchased from Calbiochem (San Diego, CA).
Residue:
333
  
Inhibitor
Name:
BDBM50067608
Synonyms:
(S)-3-Methyl-2-(naphthalene-1-sulfonylamino)-pentanoic acid ((S)-1-benzyl-2-oxo-ethyl)-amide | CHEMBL336591
Type:
Small organic molecule
Emp. Form.:
C25H28N2O4S
Mol. Mass.:
452.566
SMILES:
CCC(C)[C@H](NS(=O)(=O)c1cccc2ccccc12)C(=O)N[C@@H](Cc1ccccc1)C=O
: