Target
Acetylcholinesterase
Ligand
BDBM50079866
Substrate
Meas. Tech.
ChEMBL_27821 (CHEMBL636711)
IC50
12±n/a nM
Citation
 Camps, PEl Achab, RGörbig, DMMorral, JMuñoz-Torrero, DBadia, AEladi Baños, JVivas, NMBarril, XOrozco, MLuque, FJ Synthesis, in vitro pharmacology, and molecular modeling of very potent tacrine-huperzine A hybrids as acetylcholinesterase inhibitors of potential interest for the treatment of Alzheimer's disease. J Med Chem 42:3227-42 (1999)  
Target
Name:
Acetylcholinesterase
Synonyms:
ACES_BOVIN Acetylcholinesterase (AChE) | Acetylcholinesterase precursor
Type:
Enzyme
Mol. Mass.:
67659.62
Organism:
Bos taurus (bovine)
Description:
Residue:
613
  
Inhibitor
Name:
BDBM50079866
Synonyms:
(+)-15-ethyl-7-methyl-10-azatetracyclo[11.3.1.02,11.04,9]heptadeca-2(11),3,5,7,9,14-hexaen-3-amine (rac)15-ethyl-7-methyl-10-azatetracyclo[11.3.1.02,11.04,9]heptadeca-2(11),3,5,7,9,14-hexaen-3-amine 15-ethyl-7-methyl-10-azatetracyclo[11.3.1.02,11.04,9]heptadeca-2(11),3,5,7,9,14-hexaen-3-amine rac-huprine H5
Type:
Small organic molecule
Emp. Form.:
C19H22N2
Mol. Mass.:
278.3914
SMILES:
CCC1=CC2CC(C1)c1c(C2)nc2cc(C)ccc2c1N
: