Target
Cholinesterase
Ligand
BDBM50079866
Substrate
Meas. Tech.
ChEMBL_41432 (CHEMBL654411)
IC50
115±n/a nM
Citation
 Camps, PEl Achab, RGörbig, DMMorral, JMuñoz-Torrero, DBadia, AEladi Baños, JVivas, NMBarril, XOrozco, MLuque, FJ Synthesis, in vitro pharmacology, and molecular modeling of very potent tacrine-huperzine A hybrids as acetylcholinesterase inhibitors of potential interest for the treatment of Alzheimer's disease. J Med Chem 42:3227-42 (1999)  
Target
Name:
Cholinesterase
Synonyms:
Acylcholine acylhydrolase Butyrylcholine esterase (BChE) Butyrylcholinesterase (BuChE) CHLE_HUMAN Cholinesterases Pseudocholinesterase
Type:
Homotetramer
Mol. Mass.:
68422.27
Organism:
Homo sapiens (Human)
Description:
P06276
Residue:
602
  
Inhibitor
Name:
BDBM50079866
Synonyms:
(+)-15-ethyl-7-methyl-10-azatetracyclo[11.3.1.02,11.04,9]heptadeca-2(11),3,5,7,9,14-hexaen-3-amine (rac)15-ethyl-7-methyl-10-azatetracyclo[11.3.1.02,11.04,9]heptadeca-2(11),3,5,7,9,14-hexaen-3-amine 15-ethyl-7-methyl-10-azatetracyclo[11.3.1.02,11.04,9]heptadeca-2(11),3,5,7,9,14-hexaen-3-amine rac-huprine H5
Type:
Small organic molecule
Emp. Form.:
C19H22N2
Mol. Mass.:
278.3914
SMILES:
CCC1=CC2CC(C1)c1c(C2)nc2cc(C)ccc2c1N
: