Target
Tumor necrosis factor
Ligand
BDBM50081354
Substrate
Meas. Tech.
ChEMBL_212403 (CHEMBL816155)
IC50
5000±n/a nM
Citation
 Chao, QDeng, LShih, HLeoni, LMGenini, DCarson, DACottam, HB Substituted isoquinolines and quinazolines as potential antiinflammatory agents. Synthesis and biological evaluation of inhibitors of tumor necrosis factor alpha. J Med Chem 42:3860-73 (1999)  
Target
Name:
Tumor necrosis factor
Synonyms:
Cachectin TNF-a TNFA TNFSF2 Tumor necrosis factor (TNFa) Tumor necrosis factor ligand superfamily member 2 Tumor necrosis factor, soluble form | tumor necrosis factor alpha
Type:
Enzyme
Mol. Mass.:
25645.11
Organism:
Homo sapiens (Human)
Description:
P01375
Residue:
233
  
Inhibitor
Name:
BDBM50081354
Synonyms:
4-(7-Amino-4-oxo-1,4-dihydro-2H-quinazolin-3-yl)-butyric acid ethyl ester | CHEMBL126867
Type:
Small organic molecule
Emp. Form.:
C14H19N3O3
Mol. Mass.:
277.319
SMILES:
CCOC(=O)CCCN1CNc2cc(N)ccc2C1=O
: