Target
Alpha-1A adrenergic receptor
Ligand
BDBM50082864
Substrate
Meas. Tech.
ChEMBL_33605 (CHEMBL876765)
Ki
14±n/a nM
Citation
 Wong, WCSun, WLagu, BTian, DMarzabadi, MRZhang, FNagarathnam, DMiao, SWWetzel, JMPeng, JForray, CChang, RSChen, TBRansom, RO'Malley, SBroten, TPKling, PVyas, KPZhang, KGluchowski, C Design and synthesis of novel alpha(1)(a) adrenoceptor-selective antagonists. 4. Structure-activity relationship in the dihydropyrimidine series. J Med Chem 42:4804-13 (1999)  
Target
Name:
Alpha-1A adrenergic receptor
Synonyms:
ADA1A_HUMAN ADRA1C Alpha 1A-adrenoceptor Alpha adrenergic receptor 1a Alpha-adrenergic receptor 1c adrenergic Alpha1 | adrenergic Alpha1C
Type:
Cell-surface receptors
Mol. Mass.:
51511.67
Organism:
Homo sapiens (Human)
Description:
P35348
Residue:
466
  
Inhibitor
Name:
BDBM50082864
Synonyms:
1-{5-[6-(2,4-Difluoro-phenyl)-2,4-dimethyl-5-methylcarbamoyl-6H-pyrimidin-1-yl]-pentyl}-4-phenyl-piperidine-4-carboxylic acid methyl ester | CHEMBL142719
Type:
Small organic molecule
Emp. Form.:
C32H40F2N4O3
Mol. Mass.:
566.6818
SMILES:
CNC(=O)C1=C(C)N=C(C)N(CCCCCN2CCC(CC2)(C(=O)OC)c2ccccc2)C1c1ccc(F)cc1F
: