Target
Alpha-1A adrenergic receptor
Ligand
BDBM50366618
Substrate
Meas. Tech.
ChEMBL_33605 (CHEMBL876765)
Ki
0.20±n/a nM
Citation
 Wong, WCSun, WLagu, BTian, DMarzabadi, MRZhang, FNagarathnam, DMiao, SWWetzel, JMPeng, JForray, CChang, RSChen, TBRansom, RO'Malley, SBroten, TPKling, PVyas, KPZhang, KGluchowski, C Design and synthesis of novel alpha(1)(a) adrenoceptor-selective antagonists. 4. Structure-activity relationship in the dihydropyrimidine series. J Med Chem 42:4804-13 (1999)  
Target
Name:
Alpha-1A adrenergic receptor
Synonyms:
ADA1A_HUMAN ADRA1C Alpha 1A-adrenoceptor Alpha adrenergic receptor 1a Alpha-adrenergic receptor 1c adrenergic Alpha1 | adrenergic Alpha1C
Type:
Cell-surface receptors
Mol. Mass.:
51511.67
Organism:
Homo sapiens (Human)
Description:
P35348
Residue:
466
  
Inhibitor
Name:
BDBM50366618
Synonyms:
CHEMBL448620 | SNAP-5089
Type:
Small organic molecule
Emp. Form.:
C36H40N4O5
Mol. Mass.:
608.7266
SMILES:
COC(=O)C1C(C(C(=O)NCCCN2CCC(CC2)(c2ccccc2)c2ccccc2)=C(C)N=C1C)c1ccc(cc1)[N+]([O-])=O
: