Target
Alpha-1A adrenergic receptor
Ligand
BDBM50082882
Substrate
Meas. Tech.
ChEMBL_33605 (CHEMBL876765)
Ki
20±n/a nM
Citation
 Wong, WCSun, WLagu, BTian, DMarzabadi, MRZhang, FNagarathnam, DMiao, SWWetzel, JMPeng, JForray, CChang, RSChen, TBRansom, RO'Malley, SBroten, TPKling, PVyas, KPZhang, KGluchowski, C Design and synthesis of novel alpha(1)(a) adrenoceptor-selective antagonists. 4. Structure-activity relationship in the dihydropyrimidine series. J Med Chem 42:4804-13 (1999)  
Target
Name:
Alpha-1A adrenergic receptor
Synonyms:
ADA1A_HUMAN ADRA1C Alpha 1A-adrenoceptor Alpha adrenergic receptor 1a Alpha-adrenergic receptor 1c adrenergic Alpha1 | adrenergic Alpha1C
Type:
Cell-surface receptors
Mol. Mass.:
51511.67
Organism:
Homo sapiens (Human)
Description:
P35348
Residue:
466
  
Inhibitor
Name:
BDBM50082882
Synonyms:
1-{(R)-5-[4-(2-Carbamoyl-phenyl)-piperazin-1-yl]-4-methyl-pentyl}-6-(3,4-difluoro-phenyl)-2,4-dimethyl-1,6-dihydro-pyrimidine-5-carboxylic acid methyl ester | CHEMBL342347
Type:
Small organic molecule
Emp. Form.:
C31H39F2N5O3
Mol. Mass.:
567.6699
SMILES:
COC(=O)C1=C(C)N=C(C)N(CCC[C@@H](C)CN2CCN(CC2)c2ccccc2C(N)=O)C1c1ccc(F)c(F)c1
: