Target
Alpha-1D adrenergic receptor
Ligand
BDBM50082873
Substrate
Meas. Tech.
ChEMBL_32430 (CHEMBL646092)
Ki
65±n/a nM
Citation
 Wong, WCSun, WLagu, BTian, DMarzabadi, MRZhang, FNagarathnam, DMiao, SWWetzel, JMPeng, JForray, CChang, RSChen, TBRansom, RO'Malley, SBroten, TPKling, PVyas, KPZhang, KGluchowski, C Design and synthesis of novel alpha(1)(a) adrenoceptor-selective antagonists. 4. Structure-activity relationship in the dihydropyrimidine series. J Med Chem 42:4804-13 (1999)  
Target
Name:
Alpha-1D adrenergic receptor
Synonyms:
ADA1D_HUMAN ADRA1D Adrenergic receptor alpha Alpha 1D-adrenoreceptor Alpha-1D adrenoceptor adrenergic Alpha1D
Type:
Enzyme Catalytic Domain
Mol. Mass.:
60485.82
Organism:
Homo sapiens (Human)
Description:
adrenergic Alpha1D ADRA1D HUMAN::P25100
Residue:
572
  
Inhibitor
Name:
BDBM50082873
Synonyms:
6-(3,4-Difluoro-phenyl)-1-{5-[4-(2-methoxy-phenyl)-piperazin-1-yl]-pentyl}-2,4-dimethyl-1,6-dihydro-pyrimidine-5-carboxylic acid methyl ester | CHEMBL145587
Type:
Small organic molecule
Emp. Form.:
C30H38F2N4O3
Mol. Mass.:
540.6445
SMILES:
COC(=O)C1=C(C)N=C(C)N(CCCCCN2CCN(CC2)c2ccccc2OC)C1c1ccc(F)c(F)c1
: