Target
3',5'-cyclic-AMP phosphodiesterase
Ligand
BDBM23620
Substrate
Meas. Tech.
ChEMBL_157207 (CHEMBL768858)
IC50
5270±n/a nM
Citation
 Watanabe, NAdachi, HTakase, YOzaki, HMatsukura, MMiyazaki, KIshibashi, KIshihara, HKodama, KNishino, MKakiki, MKabasawa, Y 4-(3-Chloro-4-methoxybenzyl)aminophthalazines: synthesis and inhibitory activity toward phosphodiesterase 5. J Med Chem 43:2523-9 (2000)  
Target
Name:
3',5'-cyclic-AMP phosphodiesterase
Synonyms:
Phosphodiesterase 4A
Type:
PROTEIN
Mol. Mass.:
13615.65
Organism:
Sus scrofa
Description:
ChEMBL_155848
Residue:
118
  
Inhibitor
Name:
BDBM23620
Synonyms:
2-({6-[bis(2-hydroxyethyl)amino]-4,8-bis(piperidin-1-yl)pyrimido[5,4-d][1,3]diazin-2-yl}(2-hydroxyethyl)amino)ethan-1-ol Dipyridamine Dipyudamine Persantine cid_3108
Type:
Small organic molecule
Emp. Form.:
C24H40N8O4
Mol. Mass.:
504.6256
SMILES:
OCCN(CCO)c1nc(N2CCCCC2)c2nc(nc(N3CCCCC3)c2n1)N(CCO)CCO
: