Target
Metabotropic glutamate receptor 2
Ligand
BDBM50076392
Substrate
Meas. Tech.
ChEMBL_106052 (CHEMBL718218)
Ki
84000±n/a nM
Citation
 Bräuner-Osborne, HEgebjerg, JNielsen, EOMadsen, UKrogsgaard-Larsen, P Ligands for glutamate receptors: design and therapeutic prospects. J Med Chem 43:2609-45 (2000)  
Target
Name:
Metabotropic glutamate receptor 2
Synonyms:
GPRC1B GRM2_HUMAN Metabotropic glutamate receptor mGlu2 | metabotropic glutamate 2
Type:
Enzyme
Mol. Mass.:
95584.88
Organism:
Homo sapiens (Human)
Description:
Q14416
Residue:
872
  
Inhibitor
Name:
BDBM50076392
Synonyms:
(1S,2S)-2-((S)-1-Amino-1-carboxy-ethyl)-cyclopropanecarboxylic acid CHEMBL41013
Type:
Small organic molecule
Emp. Form.:
C7H11NO4
Mol. Mass.:
173.1665
SMILES:
C[C@](N)([C@H]1C[C@@H]1C(O)=O)C(O)=O
: