Target
Metabotropic glutamate receptor 4
Ligand
BDBM50089890
Substrate
Meas. Tech.
ChEMBL_106560 (CHEMBL716502)
Ki
21000±n/a nM
Citation
 Bräuner-Osborne, HEgebjerg, JNielsen, EOMadsen, UKrogsgaard-Larsen, P Ligands for glutamate receptors: design and therapeutic prospects. J Med Chem 43:2609-45 (2000)  
Target
Name:
Metabotropic glutamate receptor 4
Synonyms:
GPRC1D GRM4_HUMAN MGLUR4 Metabotropic glutamate receptor 4 (mGlu4) metabotropic glutamate 4
Type:
Protein
Mol. Mass.:
101899.95
Organism:
Homo sapiens (Human)
Description:
Q14833
Residue:
912
  
Inhibitor
Name:
BDBM50089890
Synonyms:
4-Amino-2-oxa-bicyclo[3.1.0]hexane-4,6-dicarboxylic acid(LY379268) | CHEMBL89000
Type:
Small organic molecule
Emp. Form.:
C7H9NO5
Mol. Mass.:
187.1501
SMILES:
N[C@]1(COC2[C@@H](C12)C(O)=O)C(O)=O
: