Target
Trypanothione reductase
Ligand
BDBM50091154
Substrate
Meas. Tech.
ChEMBL_211805 (CHEMBL811877)
IC50
5400±n/a nM
Citation
 Khan, MOAustin, SEChan, CYin, HMarks, DVaghjiani, SNKendrick, HYardley, VCroft, SLDouglas, KT Use of an additional hydrophobic binding site, the Z site, in the rational drug design of a new class of stronger trypanothione reductase inhibitor, quaternary alkylammonium phenothiazines. J Med Chem 43:3148-56 (2000)  
Target
Name:
Trypanothione reductase
Synonyms:
N(1),N(8)-bis(glutathionyl)spermidine reductase TR | TYTR_TRYCR
Type:
Homodimer; oxidoreductase
Mol. Mass.:
53868.26
Organism:
Trypanosoma cruzi
Description:
Residue:
492
  
Inhibitor
Name:
BDBM50091154
Synonyms:
CHEMBL106901 | [3-(2-Chloro-phenothiazin-10-yl)-propyl]-(3,5-dimethoxy-benzyl)-dimethyl-ammonium (OFK012)
Type:
Small organic molecule
Emp. Form.:
C26H30ClN2O2S
Mol. Mass.:
470.046
SMILES:
COc1cc(C[N+](C)(C)CCCN2c3ccccc3Sc3ccc(Cl)cc23)cc(OC)c1
: