Target
Cyclin-dependent kinase 1
Ligand
BDBM50093397
Substrate
Meas. Tech.
ChEMBL_50319 (CHEMBL661624)
IC50
430±n/a nM
Citation
 Ducrot, PLegraverend, MGrierson, DS 3D-QSAR CoMFA on cyclin-dependent kinase inhibitors. J Med Chem 43:4098-108 (2000)  
Target
Name:
Cyclin-dependent kinase 1
Synonyms:
CDC2 CDK1 CDKN1 Cell division protein kinase 1 P34CDC2 | p34 protein kinase
Type:
Enzyme Subunit
Mol. Mass.:
34101.08
Organism:
Homo sapiens (Human)
Description:
P06493
Residue:
297
  
Inhibitor
Name:
BDBM50093397
Synonyms:
(R){1-[6-(3-Chloro-phenylamino)-9-isopropyl-9H-purin-2-yl]-pyrrolidin-2-yl}-methanol CHEMBL77369
Type:
Small organic molecule
Emp. Form.:
C19H23ClN6O
Mol. Mass.:
386.879
SMILES:
CC(C)n1cnc2c(Nc3cccc(Cl)c3)nc(nc12)N1CCC[C@@H]1CO
: