Target
Neprilysin
Ligand
BDBM50084628
Substrate
Meas. Tech.
ChEMBL_64982 (CHEMBL675567)
Ki
5.6±n/a nM
Citation
 Leung, DAbbenante, GFairlie, DP Protease inhibitors: current status and future prospects. J Med Chem 43:305-41 (2000)  
Target
Name:
Neprilysin
Synonyms:
Mme Neprilysin Neutral endopeptidase 24.11
Type:
Protein
Mol. Mass.:
85789.59
Organism:
Rattus norvegicus (Rat)
Description:
P07861
Residue:
750
  
Inhibitor
Name:
BDBM50084628
Synonyms:
2-(2-Benzo[1,3]dioxol-5-ylmethyl-3-carboxysulfanyl-propionylamino)-propionic acid benzyl ester(Fasidotrilat) | CHEMBL325055
Type:
Small organic molecule
Emp. Form.:
C22H23NO7S
Mol. Mass.:
445.486
SMILES:
C[C@H](NC(=O)[C@@H](CSC(O)=O)Cc1ccc2OCOc2c1)C(=O)OCc1ccccc1
: