Target
Sodium-dependent dopamine transporter
Ligand
BDBM50086042
Substrate
Meas. Tech.
ChEMBL_62493 (CHEMBL677550)
Ki
56.4±n/a nM
Citation
 Robarge, MJAgoston, GEIzenwasser, SKopajtic, TGeorge, CKatz, JLNewman, AH Highly selective chiral N-substituted 3alpha-[bis(4'-fluorophenyl)methoxy]tropane analogues for the dopamine transporter: synthesis and comparative molecular field analysis. J Med Chem 43:1085-93 (2000)  
Target
Name:
Sodium-dependent dopamine transporter
Synonyms:
DA transporter SC6A3_RAT Sodium-dependent dopamine transporter | Sodium-dependent dopamine transporter (DAT)
Type:
Multi-pass membrane protein
Mol. Mass.:
68749.45
Organism:
Rattus norvegicus (rat)
Description:
P23977
Residue:
619
  
Inhibitor
Name:
BDBM50086042
Synonyms:
(R)-1-{3-[Bis-(4-fluoro-phenyl)-methoxy]-8-aza-bicyclo[3.2.1]oct-8-ylmethyl}-2-methyl-propylamine | CHEMBL429015
Type:
Small organic molecule
Emp. Form.:
C25H32F2N2O
Mol. Mass.:
414.5312
SMILES:
CC(C)[C@@H](N)CN1C2CCC1CC(C2)OC(c1ccc(F)cc1)c1ccc(F)cc1
: