Target
Sodium-dependent dopamine transporter
Ligand
BDBM50175155
Substrate
Meas. Tech.
ChEMBL_62493 (CHEMBL677550)
Ki
13.9±n/a nM
Citation
 Robarge, MJAgoston, GEIzenwasser, SKopajtic, TGeorge, CKatz, JLNewman, AH Highly selective chiral N-substituted 3alpha-[bis(4'-fluorophenyl)methoxy]tropane analogues for the dopamine transporter: synthesis and comparative molecular field analysis. J Med Chem 43:1085-93 (2000)  
Target
Name:
Sodium-dependent dopamine transporter
Synonyms:
DA transporter SC6A3_RAT Sodium-dependent dopamine transporter | Sodium-dependent dopamine transporter (DAT)
Type:
Multi-pass membrane protein
Mol. Mass.:
68749.45
Organism:
Rattus norvegicus (rat)
Description:
P23977
Residue:
619
  
Inhibitor
Name:
BDBM50175155
Synonyms:
2-(3-(bis(4-fluorophenyl)methoxy)-8-aza-bicyclo[3.2.1]octan-8-yl)ethanamine CHEMBL199166
Type:
Small organic molecule
Emp. Form.:
C22H26F2N2O
Mol. Mass.:
372.4514
SMILES:
NCCN1C2CCC1CC(C2)OC(c1ccc(F)cc1)c1ccc(F)cc1
: