Target
Histamine H3 receptor
Ligand
BDBM50071496
Substrate
Meas. Tech.
ChEMBL_86747 (CHEMBL694088)
Ki
7±n/a nM
Citation
 De Esch, IJMills, JEPerkins, TDRomeo, GHoffmann, MWieland, KLeurs, RMenge, WMNederkoorn, PHDean, PMTimmerman, H Development of a pharmacophore model for histamine H3 receptor antagonists, using the newly developed molecular modeling program SLATE. J Med Chem 44:1666-74 (2001)  
Target
Name:
Histamine H3 receptor
Synonyms:
HH3R Hrh3
Type:
G Protein-Coupled Receptor (GPCR)
Mol. Mass.:
48607.98
Organism:
Rattus norvegicus (rat)
Description:
Residue:
445
  
Inhibitor
Name:
BDBM50071496
Synonyms:
CHEMBL73053 | N-(4-Chloro-benzyl)-2-[4-(1H-imidazol-4-ylmethyl)-phenyl]-acetamidine
Type:
Small organic molecule
Emp. Form.:
C19H19ClN4
Mol. Mass.:
338.834
SMILES:
Clc1ccc(CNC(=N)Cc2ccc(Cc3cnc[nH]3)cc2)cc1
: