Target
Histamine H3 receptor
Ligand
BDBM50050183
Substrate
Meas. Tech.
ChEMBL_86747 (CHEMBL694088)
Ki
12±n/a nM
Citation
 De Esch, IJMills, JEPerkins, TDRomeo, GHoffmann, MWieland, KLeurs, RMenge, WMNederkoorn, PHDean, PMTimmerman, H Development of a pharmacophore model for histamine H3 receptor antagonists, using the newly developed molecular modeling program SLATE. J Med Chem 44:1666-74 (2001)  
Target
Name:
Histamine H3 receptor
Synonyms:
HH3R Hrh3
Type:
G Protein-Coupled Receptor (GPCR)
Mol. Mass.:
48607.98
Organism:
Rattus norvegicus (rat)
Description:
Residue:
445
  
Inhibitor
Name:
BDBM50050183
Synonyms:
(4-Iodo-benzyl)-carbamic acid 3-(1H-imidazol-4-yl)-propyl ester | CHEMBL16496
Type:
Small organic molecule
Emp. Form.:
C14H16IN3O2
Mol. Mass.:
385.2002
SMILES:
Ic1ccc(CNC(=O)OCCCc2cnc[nH]2)cc1
: