Target
Protein kinase C alpha type
Ligand
BDBM50100116
Substrate
Meas. Tech.
ChEMBL_153127 (CHEMBL759066)
Ki
1050±n/a nM
Citation
 Nacro, KSigano, DMYan, SNicklaus, MCPearce, LLLewin, NEGarfield, SHBlumberg, PMMarquez, VE An optimized protein kinase C activating diacylglycerol combining high binding affinity (Ki) with reduced lipophilicity (log P). J Med Chem 44:1892-904 (2001)  
Target
Name:
Protein kinase C alpha type
Synonyms:
KPCA_BOVIN PRKCA Protein kinase C alpha
Type:
Enzyme
Mol. Mass.:
76842.76
Organism:
Bos taurus (bovine)
Description:
Residue:
672
  
Inhibitor
Name:
BDBM50100116
Synonyms:
3-Methyl-but-2-enoic acid 1-hydroxymethyl-2-(3-methyl-butyryloxy)-ethyl ester | CHEMBL57211
Type:
Small organic molecule
Emp. Form.:
C13H22O5
Mol. Mass.:
258.3108
SMILES:
[#6]-[#6](-[#6])-[#6]-[#6](=O)-[#8]-[#6]-[#6@H](-[#6]-[#8])-[#8]-[#6](=O)\[#6]=[#6](\[#6])-[#6]
: