Target
Glyceraldehyde-3-phosphate dehydrogenase
Ligand
BDBM50100482
Substrate
Meas. Tech.
ChEMBL_72892 (CHEMBL684059)
IC50
50000±n/a nM
Citation
 Bressi, JCVerlinde, CLAronov, AMShaw, MLShin, SSNguyen, LNSuresh, SBuckner, FSVan Voorhis, WCKuntz, IDHol, WGGelb, MH Adenosine analogues as selective inhibitors of glyceraldehyde-3-phosphate dehydrogenase of Trypanosomatidae via structure-based drug design. J Med Chem 44:2080-93 (2001)  
Target
Name:
Glyceraldehyde-3-phosphate dehydrogenase
Synonyms:
G3P_HUMAN GAPDH | Glyceraldehyde-3-phosphate dehydrogenase liver
Type:
PROTEIN
Mol. Mass.:
36060.86
Organism:
Homo sapiens (Human)
Description:
ChEMBL_1511315
Residue:
335
  
Inhibitor
Name:
BDBM50100482
Synonyms:
CHEMBL62124 | N-(4-Hydroxy-5-hydroxymethyl-2-{6-[(4-methoxy-naphthalen-1-ylmethyl)-amino]-9H-purin-3-ylmethyl}-tetrahydro-furan-3-yl)-3-methoxy-benzamide
Type:
Small organic molecule
Emp. Form.:
C30H30N6O6
Mol. Mass.:
570.5958
SMILES:
COc1cccc(c1)C(=O)N[C@@H]1[C@H](O)[C@@H](CO)O[C@H]1n1cnc2c(NCc3ccc(OC)c4ccccc34)ncnc12
: