Target
cGMP-specific 3',5'-cyclic phosphodiesterase
Ligand
BDBM50100674
Substrate
Meas. Tech.
ChEMBL_154560 (CHEMBL757895)
IC50
0.390000±n/a nM
Citation
 Ukita, TNakamura, YKubo, AYamamoto, YMoritani, YSaruta, KHigashijima, TKotera, JTakagi, MKikkawa, KOmori, K Novel, potent, and selective phosphodiesterase 5 inhibitors: synthesis and biological activities of a series of 4-aryl-1-isoquinolinone derivatives. J Med Chem 44:2204-18 (2001)  
Target
Name:
cGMP-specific 3',5'-cyclic phosphodiesterase
Synonyms:
CGB-PDE PDE5A Phosphodiesterase 5A cGMP-specific 3',5'-cyclic phosphodiesterase
Type:
PROTEIN
Mol. Mass.:
98285.03
Organism:
Canis lupus familiaris
Description:
ChEMBL_105565
Residue:
865
  
Inhibitor
Name:
BDBM50100674
Synonyms:
CHEMBL541818 | methyl 2-(4-aminophenyl)-4-(3,5-dimethoxy-4-methylphenyl)-1-oxo-7-(2-pyridylmethoxy)-1,2-dihydro-3-isoquinolinecarboxylate.dihydrochloride
Type:
Small organic molecule
Emp. Form.:
C32H29N3O6
Mol. Mass.:
551.5892
SMILES:
COC(=O)c1c(-c2cc(OC)c(C)c(OC)c2)c2ccc(OCc3ccccn3)cc2c(=O)n1-c1ccc(N)cc1
: