Target
Phosphoribosyl pyrophosphate synthase-associated protein 2
Ligand
BDBM50105931
Substrate
Meas. Tech.
ChEMBL_154298 (CHEMBL763637)
Ki
17000000±n/a nM
Citation
 Hakimelahi, GHLy, TWMoosavi-Movahedi, AAJain, MLZakerinia, MDavari, HMei, HCSambaiah, TMoshfegh, AAHakimelahi, S Design, synthesis, and biological evaluation of novel nucleoside and nucleotide analogues as agents against DNA viruses and/or retroviruses. J Med Chem 44:3710-20 (2001)  
Target
Name:
Phosphoribosyl pyrophosphate synthase-associated protein 2
Synonyms:
KPRB_HUMAN Phosphoribosyl pyrophosphate synthetase-associated protein 2
Type:
PROTEIN
Mol. Mass.:
40929.34
Organism:
Homo sapiens (Human)
Description:
ChEMBL_154298
Residue:
369
  
Inhibitor
Name:
BDBM50105931
Synonyms:
CHEMBL123655 | [2-(6-Amino-purin-7-yl)-ethoxymethyl]-phosphonic acid
Type:
Small organic molecule
Emp. Form.:
C8H12N5O4P
Mol. Mass.:
273.1857
SMILES:
Nc1ncnc2ncn(CCOCP(O)(O)=O)c12
: