Target
Chymotrypsinogen A
Ligand
BDBM50098840
Substrate
Meas. Tech.
ChEMBL_49621 (CHEMBL660459)
Ki
3500±n/a nM
Citation
 Akahoshi, FAshimori, ASakashita, HYoshimura, TImada, TNakajima, MMitsutomi, NKuwahara, SOhtsuka, TFukaya, CMiyazaki, MNakamura, N Synthesis, structure-activity relationships, and pharmacokinetic profiles of nonpeptidic alpha-keto heterocycles as novel inhibitors of human chymase. J Med Chem 44:1286-96 (2001)  
Target
Name:
Chymotrypsinogen A
Synonyms:
Alpha-chymotrypsin Chymotrypsin A Chymotrypsin A chain B Chymotrypsinogen A | alpha-Chymotrypsin (α-Chymotrypsin)
Type:
Serine protease
Mol. Mass.:
25670.88
Organism:
Bos taurus (bovine)
Description:
Residue:
245
  
Inhibitor
Name:
BDBM50098840
Synonyms:
2-[5-Amino-2-(4-fluoro-phenyl)-6-oxo-6H-pyrimidin-1-yl]-N-(1-benzyl-2-oxo-2-thiazol-2-yl-ethyl)-acetamide | CHEMBL284665
Type:
Small organic molecule
Emp. Form.:
C24H20FN5O3S
Mol. Mass.:
477.511
SMILES:
Nc1cnc(-c2ccc(F)cc2)n(CC(=O)NC(Cc2ccccc2)C(=O)c2nccs2)c1=O
: