Target
Adenosine receptor A3
Ligand
BDBM50080398
Substrate
Meas. Tech.
ChEMBL_30462 (CHEMBL643123)
Ki
240±n/a nM
Citation
 Cappellacci, LBarboni, GPalmieri, MPasqualini, MGrifantini, MCosta, BMartini, CFranchetti, P Ribose-modified nucleosides as ligands for adenosine receptors: synthesis, conformational analysis, and biological evaluation of 1'-C-methyl adenosine analogues. J Med Chem 45:1196-202 (2002)  
Target
Name:
Adenosine receptor A3
Synonyms:
AA3R_RAT Adenosine receptor A2a and A3 | Adora3
Type:
PROTEIN
Mol. Mass.:
36643.73
Organism:
Rattus norvegicus
Description:
ChEMBL_479910
Residue:
320
  
Inhibitor
Name:
BDBM50080398
Synonyms:
(2R,3S,4R,5R)-2-Hydroxymethyl-5-[6-((S)-1-methyl-2-phenyl-ethylamino)-purin-9-yl]-tetrahydro-furan-3,4-diol CHEMBL420705 | N6-[(S)-1-Methyl-2-phenylethyl]ado (S-PIA)
Type:
Small organic molecule
Emp. Form.:
C19H23N5O4
Mol. Mass.:
385.417
SMILES:
C[C@@H](Cc1ccccc1)Nc1ncnc2n(cnc12)[C@@H]1O[C@H](CO)[C@@H](O)[C@H]1O
: